{"text_format":"1","workbook":"xlsx","n_sheets":7,"sheets":["Introduction","Project_economical_evaluation","Languages","Emission_factors_energy","Saving_measures","Potential_of_measures","Lists"],"not_rendered":{"charts":6,"images":1,"macros":1,"external_links":1,"defined_names":9,"comments":0,"pivot_tables":0},"unopened":[],"bounds":{"document_bytes":16777216,"sheet_cells":100000,"rows_first":2000,"rows_last":500,"rows_between":2000,"halvings":0,"cell_chars":16384,"cell_head_chars":4096},"cells_cut":0,"cells_raw":0,"read":"whole","date_system":"1900"}

{"sheet":"Introduction","index":0,"n_rows":5,"n_cols":1,"rows_kept":5,"cut":false,"hidden":false,"merged":[]}
[]
[]
["D.T2.2.3 Methodology to test the tool to assess public investments for industry's low carbon transition"]
["Annex II - Project level tool calculator"]
["Local specification: Austria"]

{"sheet":"Project_economical_evaluation","index":1,"n_rows":16,"n_cols":12,"rows_kept":16,"cut":false,"hidden":false,"merged":[[1,5,4,11],[5,9,5,11],[6,1,9,1],[10,1,11,1],[6,4,13,4],[5,1,5,3],[6,9,14,9],[13,10,13,11],[5,4,5,8],[1,4,4,4],[1,2,1,3],[2,2,2,3],[3,2,3,3],[4,2,4,3]]}
["EN"]
[null,"Company name:",null,null,"Description:"]
[null,"Project name:"]
[null,"Project ID:"]
[null,"Date:"]
[null,"INPUT",null,null,"INPUT",null,null,null,null,"OUTPUT"]
[null,"Investment","Total",150000,"Expected energy savings & cost of energy","Electricity",277.77777777777777,"kWh",0.5,"OUTPUT","Expected drop of CO2 emissions",{"$f":" (Emission_factors_energy!D12 * G7)*(0.0036/VLOOKUP(H7,Table4[],2,FALSE))+(Emission_factors_energy!D67 * G8)*(0.0036/VLOOKUP(H8,Table4[],2,FALSE))+(Emission_factors_energy!D11 * G9)*(0.0036/VLOOKUP(H9,Table4[],2,FALSE))+(Emission_factors_energy!D49 * G10)*(0.0036/VLOOKUP(H10,Table4[],2,FALSE))+(Emission_factors_energy!D85 * G11)*(0.0036/VLOOKUP(H11,Table4[],2,FALSE))+(Emission_factors_energy!D40 * G12)*(0.0036/VLOOKUP(H12,Table4[],2,FALSE))+(Emission_factors_energy!D31 * G13)*(0.0036/VLOOKUP(H13,Table4[],2,FALSE))","v":15.354486486486486}]
[null,null,"Loan",0.4,null,"Natural Gas",0,"kWh",0.2,null,"Expected drop of CH4 emissions",{"$f":" (Emission_factors_energy!E12 * G7)*(0.0036/VLOOKUP(H7,Table4[],2,FALSE))+(Emission_factors_energy!E67 * G8)*(0.0036/VLOOKUP(H8,Table4[],2,FALSE))+(Emission_factors_energy!E11 * G9)*(0.0036/VLOOKUP(H9,Table4[],2,FALSE))+(Emission_factors_energy!E49 * G10)*(0.0036/VLOOKUP(H10,Table4[],2,FALSE))+(Emission_factors_energy!E85 * G11)*(0.0036/VLOOKUP(H11,Table4[],2,FALSE))+(Emission_factors_energy!E40 * G12)*(0.0036/VLOOKUP(H12,Table4[],2,FALSE))+(Emission_factors_energy!E31 * G13)*(0.0036/VLOOKUP(H13,Table4[],2,FALSE))","v":24.900715303917625}]
{"$rows_left_out":9}
{"sheet":"Languages","index":2,"n_rows":43,"n_cols":21,"rows_kept":43,"cut":false,"hidden":true,"merged":[]}
["EN","BG","CS","DE","EL","ES","ET","FI","FR","GA","HR","HU","IT","LT","LV","MK","NL","PL","PT","SL","SK"]
[1,2,3,4,5,6,7,8,9,10,11,12,13,14,15,16,17,18,19,20,21]
[]
["Investment",null,null,null,null,null,null,null,"Investissement"]
["Loan",null,null,null,null,null,null,null,"Pret"]
["Own Resource",null,null,null,null,null,null,null,"Capitaux Propres"]
["Measure",null,null,null,null,null,null,null,"Mesure"]
["Total",null,null,null,null,null,null,null,"Total"]
{"$rows_left_out":36}
{"sheet":"Emission_factors_energy","index":3,"n_rows":93,"n_cols":6,"rows_kept":93,"cut":false,"hidden":true,"merged":[]}
["Saved energy carrier","Sector","Key","CO2 [kg/GJ]","CH4 [g/GJ]","N2O [g/GJ]"]
["All energy carriers","Industry",{"$f":"A2 & \"#\" & B2","v":"All energy carriers#Industry"},93,10,1.5]
["All energy carriers","Industry - food and tobacco","All energy carriers#Industry - food and tobacco",93,10,1.5]
["All energy carriers","Industry - fuel mining and processing","All energy carriers#Industry - fuel mining and processing",93,10,1.5]
["All energy carriers","Industry - chemical and petrochemical","All energy carriers#Industry - chemical and petrochemical",93,10,1.5]
["All energy carriers","Industry - iron and steel","All energy carriers#Industry - iron and steel",93,10,1.5]
["All energy carriers","Industry - mineral materials","All energy carriers#Industry - mineral materials",93,10,1.5]
["All energy carriers","Industry - nonferrous metalls","All energy carriers#Industry - nonferrous metalls",93,10,1.5]
{"$rows_left_out":86}
{"sheet":"Saving_measures","index":4,"n_rows":53,"n_cols":22,"rows_kept":53,"cut":false,"hidden":true,"merged":[]}
["Measure","Cost type","Measure detail","Unit investments [€/GJ]","Subsidy share [%]","Annual Cost Saved [€/GJ.y]","Investment costs [€]","Subsidy [€]","Payback period w/o subsidy [y]","Energy saving potential [TJ]","Lifetime [y]","Energy carrier saved","The most similar sector","Drop of CO2 emissions [t]","Drop of CH4 emissions[kg]","Drop of N2O emissions [kg]","Drop of CO2eq emissions [t]","EF of CO2 [kg/GJ]","EF of CH4 [g/GJ]","EF of N2O [g/GJ]","EF of CO2 eq [kg/GJ]","Unit investments [Kč/t CO2 eq]"]
["Buildings insulation","MAX",{"$f":"Saving_measures[[#This Row],[Measure]] & \"#\" & Saving_measures[[#This Row],[Cost type]]","v":"Buildings insulation#MAX"},390.82935014824631,{"$f":"VLOOKUP(Saving_measures[[#This Row],[Measure detail]],Potential_of_measures!$C$1:$E$192,3,0)","v":0.875},{"$f":"Saving_measures[[#This Row],[Unit investments '[€/GJ']]]/Saving_measures[[#This Row],[Payback period w/o subsidy '[y']]]","v":9.7707337537061569},{"$f":"Saving_measures[[#This Row],[Energy saving potential '[TJ']]]*Saving_measures[[#This Row],[Unit investments '[€/GJ']]]*1000","v":846887897.08239746},{"$f":"Saving_measures[[#This Row],[Subsidy share '[%']]]*Saving_measures[[#This Row],[Investment costs '[€']]]","v":741026909.94709778},40,{"$f":"VLOOKUP(Saving_measures[[#This Row],[Measure detail]],Potential_of_measures!$C$1:$E$192,2,0)","v":2166.8994326070001},25,"Fuels and heat","Industry",{"$f":"Saving_measures[[#This Row],[Energy saving potential '[TJ']]]*Saving_measures[[#This Row],[EF of CO2 '[kg/GJ']]]","v":169018.155743346},{"$f":"Saving_measures[[#This Row],[Energy saving potential '[TJ']]]*Saving_measures[[#This Row],[EF of CH4 '[g/GJ']]]","v":6500.6982978209999},{"$f":"Saving_measures[[#This Row],[Energy saving potential '[TJ']]]*Saving_measures[[#This Row],[EF of N2O '[g/GJ']]]","v":1300.1396595642},{"$f":"Saving_measures[[#This Row],[Energy saving potential '[TJ']]]*Saving_measures[[#This Row],[EF of CO2 eq '[kg/GJ']]]","v":169568.11481934166},{"$f":"VLOOKUP(Saving_measures[[#This Row],[Energy carrier saved]] & \"#\" & Saving_measures[[#This Row],[The most similar sector]],Emiskoef,2,FALSE)","v":78},{"$f":"VLOOKUP(Saving_measures[[#This Row],[Energy carrier saved]] & \"#\" & Saving_measures[[#This Row],[The most similar sector]],Emiskoef,3,FALSE)","v":3},{"$f":"VLOOKUP(Saving_measures[[#This Row],[Energy carrier saved]] & \"#\" & Saving_measures[[#This Row],[The most similar sector]],Emiskoef,4,FALSE)","v":0.6},{"$f":"Saving_measures[[#This Row],[EF of CO2 '[kg/GJ']]]+0.025*Saving_measures[[#This Row],[EF of CH4 '[g/GJ']]]+0.298*Saving_measures[[#This Row],[EF of N2O '[g/GJ']]]","v":78.253799999999998},{"$f":"1000*Saving_measures[[#This Row],[Unit investments '[€/GJ']]]/Saving_measures[[#This Row],[EF of CO2 eq '[kg/GJ']]]","v":4994.381744378501}]
["Buildings insulation","MIN",{"$f":"Saving_measures[[#This Row],[Measure]] & \"#\" & Saving_measures[[#This Row],[Cost type]]","v":"Buildings insulation#MIN"},174.66395706307821,{"$f":"VLOOKUP(Saving_measures[[#This Row],[Measure detail]],Potential_of_measures!$C$1:$E$192,3,0)","v":0.58333333333333326},{"$f":"Saving_measures[[#This Row],[Unit investments '[€/GJ']]]/Saving_measures[[#This Row],[Payback period w/o subsidy '[y']]]","v":14.555329755256517},{"$f":"Saving_measures[[#This Row],[Energy saving potential '[TJ']]]*Saving_measures[[#This Row],[Unit investments '[€/GJ']]]*1000","v":378479229.45687765},{"$f":"Saving_measures[[#This Row],[Subsidy share '[%']]]*Saving_measures[[#This Row],[Investment costs '[€']]]","v":220779550.51651195},12,{"$f":"VLOOKUP(Saving_measures[[#This Row],[Measure detail]],Potential_of_measures!$C$1:$E$192,2,0)","v":2166.8994326070001},25,"Fuels and heat","Industry",{"$f":"Saving_measures[[#This Row],[Energy saving potential '[TJ']]]*Saving_measures[[#This Row],[EF of CO2 '[kg/GJ']]]","v":169018.155743346},{"$f":"Saving_measures[[#This Row],[Energy saving potential '[TJ']]]*Saving_measures[[#This Row],[EF of CH4 '[g/GJ']]]","v":6500.6982978209999},{"$f":"Saving_measures[[#This Row],[Energy saving potential '[TJ']]]*Saving_measures[[#This Row],[EF of N2O '[g/GJ']]]","v":1300.1396595642},{"$f":"Saving_measures[[#This Row],[Energy saving potential '[TJ']]]*Saving_measures[[#This Row],[EF of CO2 eq '[kg/GJ']]]","v":169568.11481934166},{"$f":"VLOOKUP(Saving_measures[[#This Row],[Energy carrier saved]] & \"#\" & Saving_measures[[#This Row],[The most similar sector]],Emiskoef,2,FALSE)","v":78},{"$f":"VLOOKUP(Saving_measures[[#This Row],[Energy carrier saved]] & \"#\" & Saving_measures[[#This Row],[The most similar sector]],Emiskoef,3,FALSE)","v":3},{"$f":"VLOOKUP(Saving_measures[[#This Row],[Energy carrier saved]] & \"#\" & Saving_measures[[#This Row],[The most similar sector]],Emiskoef,4,FALSE)","v":0.6},{"$f":"Saving_measures[[#This Row],[EF of CO2 '[kg/GJ']]]+0.025*Saving_measures[[#This Row],[EF of CH4 '[g/GJ']]]+0.298*Saving_measures[[#This Row],[EF of N2O '[g/GJ']]]","v":78.253799999999998},{"$f":"1000*Saving_measures[[#This Row],[Unit investments '[€/GJ']]]/Saving_measures[[#This Row],[EF of CO2 eq '[kg/GJ']]]","v":2232.0188548425535}]
["Buildings insulation","TYP",{"$f":"Saving_measures[[#This Row],[Measure]] & \"#\" & Saving_measures[[#This Row],[Cost type]]","v":"Buildings insulation#TYP"},249.91685322675752,{"$f":"VLOOKUP(Saving_measures[[#This Row],[Measure detail]],Potential_of_measures!$C$1:$E$192,3,0)","v":0.75},{"$f":"Saving_measures[[#This Row],[Unit investments '[€/GJ']]]/Saving_measures[[#This Row],[Payback period w/o subsidy '[y']]]","v":12.495842661337877},{"$f":"Saving_measures[[#This Row],[Energy saving potential '[TJ']]]*Saving_measures[[#This Row],[Unit investments '[€/GJ']]]*1000","v":1083089374.9119756},{"$f":"Saving_measures[[#This Row],[Subsidy share '[%']]]*Saving_measures[[#This Row],[Investment costs '[€']]]","v":812317031.18398166},20,{"$f":"VLOOKUP(Saving_measures[[#This Row],[Measure detail]],Potential_of_measures!$C$1:$E$192,2,0)","v":4333.7988652140002},25,"Fuels and heat","Industry",{"$f":"Saving_measures[[#This Row],[Energy saving potential '[TJ']]]*Saving_measures[[#This Row],[EF of CO2 '[kg/GJ']]]","v":338036.31148669199},{"$f":"Saving_measures[[#This Row],[Energy saving potential '[TJ']]]*Saving_measures[[#This Row],[EF of CH4 '[g/GJ']]]","v":13001.396595642},{"$f":"Saving_measures[[#This Row],[Energy saving potential '[TJ']]]*Saving_measures[[#This Row],[EF of N2O '[g/GJ']]]","v":2600.2793191283999},{"$f":"Saving_measures[[#This Row],[Energy saving potential '[TJ']]]*Saving_measures[[#This Row],[EF of CO2 eq '[kg/GJ']]]","v":339136.22963868332},{"$f":"VLOOKUP(Saving_measures[[#This Row],[Energy carrier saved]] & \"#\" & Saving_measures[[#This Row],[The most similar sector]],Emiskoef,2,FALSE)","v":78},{"$f":"VLOOKUP(Saving_measures[[#This Row],[Energy carrier saved]] & \"#\" & Saving_measures[[#This Row],[The most similar sector]],Emiskoef,3,FALSE)","v":3},{"$f":"VLOOKUP(Saving_measures[[#This Row],[Energy carrier saved]] & \"#\" & Saving_measures[[#This Row],[The most similar sector]],Emiskoef,4,FALSE)","v":0.6},{"$f":"Saving_measures[[#This Row],[EF of CO2 '[kg/GJ']]]+0.025*Saving_measures[[#This Row],[EF of CH4 '[g/GJ']]]+0.298*Saving_measures[[#This Row],[EF of N2O '[g/GJ']]]","v":78.253799999999998},{"$f":"1000*Saving_measures[[#This Row],[Unit investments '[€/GJ']]]/Saving_measures[[#This Row],[EF of CO2 eq '[kg/GJ']]]","v":3193.6705083556008}]
["Contol of circulation pumps","MAX",{"$f":"Saving_measures[[#This Row],[Measure]] & \"#\" & Saving_measures[[#This Row],[Cost type]]","v":"Contol of circulation pumps#MAX"},78.431372549019613,{"$f":"VLOOKUP(Saving_measures[[#This Row],[Measure detail]],Potential_of_measures!$C$1:$E$192,3,0)","v":0.2857142857142857},{"$f":"Saving_measures[[#This Row],[Unit investments '[€/GJ']]]/Saving_measures[[#This Row],[Payback period w/o subsidy '[y']]]","v":11.204481792717088},{"$f":"Saving_measures[[#This Row],[Energy saving potential '[TJ']]]*Saving_measures[[#This Row],[Unit investments '[€/GJ']]]*1000","v":1232858.247352941},{"$f":"Saving_measures[[#This Row],[Subsidy share '[%']]]*Saving_measures[[#This Row],[Investment costs '[€']]]","v":352245.2135294117},7,{"$f":"VLOOKUP(Saving_measures[[#This Row],[Measure detail]],Potential_of_measures!$C$1:$E$192,2,0)","v":15.718942653749997},20,"Electricity","Industry",{"$f":"Saving_measures[[#This Row],[Energy saving potential '[TJ']]]*Saving_measures[[#This Row],[EF of CO2 '[kg/GJ']]]","v":241.35629255886036},{"$f":"Saving_measures[[#This Row],[Energy saving potential '[TJ']]]*Saving_measures[[#This Row],[EF of CH4 '[g/GJ']]]","v":391.41291589963612},{"$f":"Saving_measures[[#This Row],[Energy saving potential '[TJ']]]*Saving_measures[[#This Row],[EF of N2O '[g/GJ']]]","v":50.425502026748873},{"$f":"Saving_measures[[#This Row],[Energy saving potential '[TJ']]]*Saving_measures[[#This Row],[EF of CO2 eq '[kg/GJ']]]","v":266.16841506032239},{"$f":"VLOOKUP(Saving_measures[[#This Row],[Energy carrier saved]] & \"#\" & Saving_measures[[#This Row],[The most similar sector]],Emiskoef,2,FALSE)","v":15.354486486486486},{"$f":"VLOOKUP(Saving_measures[[#This Row],[Energy carrier saved]] & \"#\" & Saving_measures[[#This Row],[The most similar sector]],Emiskoef,3,FALSE)","v":24.900715303917629},{"$f":"VLOOKUP(Saving_measures[[#This Row],[Energy carrier saved]] & \"#\" & Saving_measures[[#This Row],[The most similar sector]],Emiskoef,4,FALSE)","v":3.2079449068235575},{"$f":"Saving_measures[[#This Row],[EF of CO2 '[kg/GJ']]]+0.025*Saving_measures[[#This Row],[EF of CH4 '[g/GJ']]]+0.298*Saving_measures[[#This Row],[EF of N2O '[g/GJ']]]","v":16.932971951317846},{"$f":"1000*Saving_measures[[#This Row],[Unit investments '[€/GJ']]]/Saving_measures[[#This Row],[EF of CO2 eq '[kg/GJ']]]","v":4631.8728203477303}]
["Contol of circulation pumps","MIN",{"$f":"Saving_measures[[#This Row],[Measure]] & \"#\" & Saving_measures[[#This Row],[Cost type]]","v":"Contol of circulation pumps#MIN"},36.078431372549019,{"$f":"VLOOKUP(Saving_measures[[#This Row],[Measure detail]],Potential_of_measures!$C$1:$E$192,3,0)","v":0},{"$f":"Saving_measures[[#This Row],[Unit investments '[€/GJ']]]/Saving_measures[[#This Row],[Payback period w/o subsidy '[y']]]","v":18.03921568627451},{"$f":"Saving_measures[[#This Row],[Energy saving potential '[TJ']]]*Saving_measures[[#This Row],[Unit investments '[€/GJ']]]*1000","v":567114.79378235282},{"$f":"Saving_measures[[#This Row],[Subsidy share '[%']]]*Saving_measures[[#This Row],[Investment costs '[€']]]","v":0},2,{"$f":"VLOOKUP(Saving_measures[[#This Row],[Measure detail]],Potential_of_measures!$C$1:$E$192,2,0)","v":15.718942653749997},20,"Electricity","Industry",{"$f":"Saving_measures[[#This Row],[Energy saving potential '[TJ']]]*Saving_measures[[#This Row],[EF of CO2 '[kg/GJ']]]","v":241.35629255886036},{"$f":"Saving_measures[[#This Row],[Energy saving potential '[TJ']]]*Saving_measures[[#This Row],[EF of CH4 '[g/GJ']]]","v":391.41291589963612},{"$f":"Saving_measures[[#This Row],[Energy saving potential '[TJ']]]*Saving_measures[[#This Row],[EF of N2O '[g/GJ']]]","v":50.425502026748873},{"$f":"Saving_measures[[#This Row],[Energy saving potential '[TJ']]]*Saving_measures[[#This Row],[EF of CO2 eq '[kg/GJ']]]","v":266.16841506032239},{"$f":"VLOOKUP(Saving_measures[[#This Row],[Energy carrier saved]] & \"#\" & Saving_measures[[#This Row],[The most similar sector]],Emiskoef,2,FALSE)","v":15.354486486486486},{"$f":"VLOOKUP(Saving_measures[[#This Row],[Energy carrier saved]] & \"#\" & Saving_measures[[#This Row],[The most similar sector]],Emiskoef,3,FALSE)","v":24.900715303917629},{"$f":"VLOOKUP(Saving_measures[[#This Row],[Energy carrier saved]] & \"#\" & Saving_measures[[#This Row],[The most similar sector]],Emiskoef,4,FALSE)","v":3.2079449068235575},{"$f":"Saving_measures[[#This Row],[EF of CO2 '[kg/GJ']]]+0.025*Saving_measures[[#This Row],[EF of CH4 '[g/GJ']]]+0.298*Saving_measures[[#This Row],[EF of N2O '[g/GJ']]]","v":16.932971951317846},{"$f":"1000*Saving_measures[[#This Row],[Unit investments '[€/GJ']]]/Saving_measures[[#This Row],[EF of CO2 eq '[kg/GJ']]]","v":2130.6614973599562}]
["Contol of circulation pumps","TYP",{"$f":"Saving_measures[[#This Row],[Measure]] & \"#\" & Saving_measures[[#This Row],[Cost type]]","v":"Contol of circulation pumps#TYP"},54.901960784313722,{"$f":"VLOOKUP(Saving_measures[[#This Row],[Measure detail]],Potential_of_measures!$C$1:$E$192,3,0)","v":0},{"$f":"Saving_measures[[#This Row],[Unit investments '[€/GJ']]]/Saving_measures[[#This Row],[Payback period w/o subsidy '[y']]]","v":13.725490196078431},{"$f":"Saving_measures[[#This Row],[Energy saving potential '[TJ']]]*Saving_measures[[#This Row],[Unit investments '[€/GJ']]]*1000","v":1726001.5462941171},{"$f":"Saving_measures[[#This Row],[Subsidy share '[%']]]*Saving_measures[[#This Row],[Investment costs '[€']]]","v":0},4,{"$f":"VLOOKUP(Saving_measures[[#This Row],[Measure detail]],Potential_of_measures!$C$1:$E$192,2,0)","v":31.437885307499993},20,"Electricity","Industry",{"$f":"Saving_measures[[#This Row],[Energy saving potential '[TJ']]]*Saving_measures[[#This Row],[EF of CO2 '[kg/GJ']]]","v":482.71258511772072},{"$f":"Saving_measures[[#This Row],[Energy saving potential '[TJ']]]*Saving_measures[[#This Row],[EF of CH4 '[g/GJ']]]","v":782.82583179927224},{"$f":"Saving_measures[[#This Row],[Energy saving potential '[TJ']]]*Saving_measures[[#This Row],[EF of N2O '[g/GJ']]]","v":100.85100405349775},{"$f":"Saving_measures[[#This Row],[Energy saving potential '[TJ']]]*Saving_measures[[#This Row],[EF of CO2 eq '[kg/GJ']]]","v":532.33683012064478},{"$f":"VLOOKUP(Saving_measures[[#This Row],[Energy carrier saved]] & \"#\" & Saving_measures[[#This Row],[The most similar sector]],Emiskoef,2,FALSE)","v":15.354486486486486},{"$f":"VLOOKUP(Saving_measures[[#This Row],[Energy carrier saved]] & \"#\" & Saving_measures[[#This Row],[The most similar sector]],Emiskoef,3,FALSE)","v":24.900715303917629},{"$f":"VLOOKUP(Saving_measures[[#This Row],[Energy carrier saved]] & \"#\" & Saving_measures[[#This Row],[The most similar sector]],Emiskoef,4,FALSE)","v":3.2079449068235575},{"$f":"Saving_measures[[#This Row],[EF of CO2 '[kg/GJ']]]+0.025*Saving_measures[[#This Row],[EF of CH4 '[g/GJ']]]+0.298*Saving_measures[[#This Row],[EF of N2O '[g/GJ']]]","v":16.932971951317846},{"$f":"1000*Saving_measures[[#This Row],[Unit investments '[€/GJ']]]/Saving_measures[[#This Row],[EF of CO2 eq '[kg/GJ']]]","v":3242.3109742434112}]
["Decrease of losses in heat distribution","MAX",{"$f":"Saving_measures[[#This Row],[Measure]] & \"#\" & Saving_measures[[#This Row],[Cost type]]","v":"Decrease of losses in heat distribution#MAX"},784.31372549019613,{"$f":"VLOOKUP(Saving_measures[[#This Row],[Measure detail]],Potential_of_measures!$C$1:$E$192,3,0)","v":0.91666666666666663},{"$f":"Saving_measures[[#This Row],[Unit investments '[€/GJ']]]/Saving_measures[[#This Row],[Payback period w/o subsidy '[y']]]","v":13.071895424836603},{"$f":"Saving_measures[[#This Row],[Energy saving potential '[TJ']]]*Saving_measures[[#This Row],[Unit investments '[€/GJ']]]*1000","v":238970795.57647058},{"$f":"Saving_measures[[#This Row],[Subsidy share '[%']]]*Saving_measures[[#This Row],[Investment costs '[€']]]","v":219056562.6117647},60,{"$f":"VLOOKUP(Saving_measures[[#This Row],[Measure detail]],Potential_of_measures!$C$1:$E$192,2,0)","v":304.68776435999996},30,"Heat","Industry",{"$f":"Saving_measures[[#This Row],[Energy saving potential '[TJ']]]*Saving_measures[[#This Row],[EF of CO2 '[kg/GJ']]]","v":15622.686810177043},{"$f":"Saving_measures[[#This Row],[Energy saving potential '[TJ']]]*Saving_measures[[#This Row],[EF of CH4 '[g/GJ']]]","v":8260.0197632285253},{"$f":"Saving_measures[[#This Row],[Energy saving potential '[TJ']]]*Saving_measures[[#This Row],[EF of N2O '[g/GJ']]]","v":341.30725056357528},{"$f":"Saving_measures[[#This Row],[Energy saving potential '[TJ']]]*Saving_measures[[#This Row],[EF of CO2 eq '[kg/GJ']]]","v":15930.896864925702},{"$f":"VLOOKUP(Saving_measures[[#This Row],[Energy carrier saved]] & \"#\" & Saving_measures[[#This Row],[The most similar sector]],Emiskoef,2,FALSE)","v":51.274414786536212},{"$f":"VLOOKUP(Saving_measures[[#This Row],[Energy carrier saved]] & \"#\" & Saving_measures[[#This Row],[The most similar sector]],Emiskoef,3,FALSE)","v":27.109784932055902},{"$f":"VLOOKUP(Saving_measures[[#This Row],[Energy carrier saved]] & \"#\" & Saving_measures[[#This Row],[The most similar sector]],Emiskoef,4,FALSE)","v":1.1201869273631482},{"$f":"Saving_measures[[#This Row],[EF of CO2 '[kg/GJ']]]+0.025*Saving_measures[[#This Row],[EF of CH4 '[g/GJ']]]+0.298*Saving_measures[[#This Row],[EF of N2O '[g/GJ']]]","v":52.285975114191828},{"$f":"1000*Saving_measures[[#This Row],[Unit investments '[€/GJ']]]/Saving_measures[[#This Row],[EF of CO2 eq '[kg/GJ']]]","v":15000.460903277908}]
{"$rows_left_out":46}
{"sheet":"Potential_of_measures","index":5,"n_rows":52,"n_cols":5,"rows_kept":52,"cut":false,"hidden":true,"merged":[]}
["Buildings insulation","MAX",{"$f":"A1 & \"#\" & B1","v":"Buildings insulation#MAX"},2166.8994326070001,0.875]
["Buildings insulation","MIN","Buildings insulation#MIN",2166.8994326070001,0.58333333333333326]
["Buildings insulation","TYP","Buildings insulation#TYP",4333.7988652140002,0.75]
["Contol of circulation pumps","MAX","Contol of circulation pumps#MAX",15.718942653749997,0.2857142857142857]
["Contol of circulation pumps","MIN","Contol of circulation pumps#MIN",15.718942653749997,0]
["Contol of circulation pumps","TYP","Contol of circulation pumps#TYP",31.437885307499993,0]
["Decrease of losses in heat distribution","MAX","Decrease of losses in heat distribution#MAX",304.68776435999996,0.91666666666666663]
["Decrease of losses in heat distribution","MIN","Decrease of losses in heat distribution#MIN",304.68776435999996,0.66666666666666674]
{"$rows_left_out":45}
{"sheet":"Lists","index":6,"n_rows":22,"n_cols":8,"rows_kept":22,"cut":false,"hidden":true,"merged":[]}
["Energy_saving_measures[List of energy saving measures]"]
[]
["List of energy saving measures",null,"Saved energy carriers",null,"NIR sectors for energy savings",null,"Column1","Column2"]
["Buildings insulation",null,"All energy carriers",null,"Energy",null,"kWh",1]
["Contol of circulation pumps",null,"Coal",null,"Industry",null,"MWh",1E-3]
["Decrease of losses in heat distribution",null,"Electricity",null,null,null,"GWh",9.9999999999999995E-7]
["Energy management",null,"Fuels and heat",null,null,null,"MJ",3.6]
["Change of technological processes",null,"Fuels only",null,null,null,"GJ",3.5999999999999999E-3]
{"$rows_left_out":14}