{"text_format":"1","workbook":"xlsx","n_sheets":6,"sheets":["README","Explanatory notes","Input data","Heat price","Results","Interpretation"],"not_rendered":{"charts":2,"images":4,"macros":1,"external_links":0,"defined_names":286,"comments":3,"pivot_tables":0},"unopened":[],"bounds":{"document_bytes":16777216,"sheet_cells":100000,"rows_first":2000,"rows_last":500,"rows_between":2000,"halvings":0,"cell_chars":16384,"cell_head_chars":4096},"cells_cut":0,"cells_raw":0,"read":"whole","date_system":"1900"}

{"sheet":"README","index":0,"n_rows":12,"n_cols":1,"rows_kept":12,"cut":false,"hidden":false,"merged":[]}
[]
[]
[]
["This excel-tool is a translation based on the Wirtschaflichkeitsrechnung tool - profitability calculation tool - developed by the Austrian \"klimaaktiv QM Heizwerke\" program."]
["The translation was carried out within the European project ENhancing renewable heaT planning for improving the aiR quAlity of commuNities (ENTRAIN)."]
[]
[]
["Please contact Sabrina Metz at s.metz@aee.at for any suggestion or bug-report of this tool."]
[]
["\"klimaaktiv QM Heizwerke\" is a quality management program throughout Austria in order to improve the technical quality and efficiency of biomass heating plants and district heating grids. This is achieved by accompanying quality control during the planning, construction and operation phase. For consulting and further information see www.klimaaktiv.at/qmheizwerke "]
[]
["\"klimaaktiv QM Heizwerke\" is supported by the Austrian Federal Ministry for Climate Protection, Environment, Energy, Mobility, Innovation and Technology (BMK)."]

{"sheet":"Explanatory notes","index":1,"n_rows":140,"n_cols":2,"rows_kept":140,"cut":false,"hidden":false,"merged":[]}
[null,"Explanatory notes"]
[null,"Basic information of this tool:\nDisclaimer\nThis Excel-tool was created very carefully. Nevertheless, the authors cannot guarantee nor warrant the results and conclusions derived from them. The simplifications may result in certain \"errors\" due to the type of calculation, e.g. it is not taken into account whether a payment is made at the beginning or end of a year since a year is regarded as one period.\n! Attention: Even if warning feedbacks regarding various input limits are issued by the tool, it cannot be ruled out that incorrect input values may lead to an inaccurate representation of the final results. The correct assessment of the consequences of certain assumptions is the responsibility of the user of the tool.\n\nCalculation process: \nBased on the actual annual heat demand, the annual efficiency rates of the network and the boiler plants, the necessary fuel consumption and the associated annual costs are calculated. \n\nFormulas:\nAll formulas and calculations are shown in this tool. Please note that changes to the tool may result in errors and thus to incorrect results.\n\nSensitivity analysis / What-if calculation:\nBy varying the input parameters and storing the individual results of the profitability assessment, it is possible to evaluate the influence of individual parameters on the positive economic development of the heating plant."]
[null,"The presentation in the results table is made at the end of the respective period of the year; developments during the year are not taken into account. The column present value (reference year 0) is discounted to the start of the project = BEFORE period 1. The net present value is obtained in the same way. "]
[100,"All € - amounts must be indicated without value-added tax (VAT). Input fields are highlighted in light yellow. "]
[101,"Warnings: A short explanatory text appears in the Warnings field if implausible values are introduced in the input sheet (e.g. efficiency = zero or similar)."]
[102,"Enter values for the heat sale, the heat price and heat consumption. These and subsidiues/connection fees are essential income components of a biomass heating plant."]
[103,"Total planned heat sale in MWh /a at the end of the project (current enlargemend phase) This corresponds to a heat sale development of 100% [107]. The fuel consumption is calculated based on the annual efficiency of the district heating network and the annual efficiency of the boiler."]
[104,"Internal heat consumption. I.e. amount of heat taken from the pressureless manifold and not sold, e.g. heat for the heating control room, deicing ramp, etc."]
[105,"Annual efficiency of the biomass boiler(s). The ratio between the amount of heat generated and the amount of fuel heat used. Does NOT correspond to the achievable instantaneous efficiency of the boiler! Excessively optimistic assumptions lead to significantly lower fuel consumption and thus to the assumption that fuel costs are too low."]
[106,"Annual efficiency of the district heating network (40 ... 98%). The ratio of  the heat sold (delivered) from the grid to the  heat fed into the grid. It Does NOT correspond to the instantaneous efficiency of the district heating network at the design operation point! "]
[107,"Development of heat sale in % of the total annual heat sale defined in [103] This information can be used to consider network enlargements that will take place in several stages over the first 3 years. In year no. 3 100% must be reached!"]
[108,"Annual increase of the district heating network’s heat sale after the 3rd year. Through consistent network enlargement/densification (connection of additional customers), the heat consumption  can exceed 100 % in relation to the value originally taken into account for the third year. Any necessary investments that occur should be entered under \"Additional disbursements \" in the \"Results\" sheet in the years in which they occur."]
[109,"Net heat sales price. It can be calculated in the sheet \"Heat price\" from a basic charge, meter charge, energy charge and graduation of prices based on yearly heat consumption ."]
[110,"Average annual price adjustment of the heat sales price in percent: If linked to a standard consumer price index, rates of between 1 % and 3 % are to be expected. (This should not be higher than the adjustment values for electricity, fuel or personnel costs ). "]
[111,"Connection fees, if the heat transfer station is owned by the network operator and not the consumer. One-time fees paid  by heat customers for the installation of connections (piping + heat transfer stations). These lead to positive current income, but at the same time, investment costs for the district heating transfer station have the be considered .  The value corresponds to a heating network’s heat consumption factor of 100%.  "]
[112,"Other Incomes (e.g. fuel sales from heating plant, etc.)."]
[113,"Average annual price adjustment for other incomes (e.g. consumer price index)."]
[114,"Base year for the investments - used as year no. 0 for the profitability assessment "]
[120,"Fuel price and operating costs, significant expenditure positions for a biomass heating plant."]
[121,"Biomass price in € per MWh energy content. "]
{"$rows_left_out":121}
{"sheet":"Input data","index":2,"n_rows":105,"n_cols":36,"rows_kept":105,"cut":false,"hidden":false,"merged":[[90,13,90,15],[104,13,104,15],[103,13,103,15],[74,13,74,15],[102,13,102,15],[76,13,76,15],[94,13,94,15],[97,13,97,15],[99,13,99,15],[101,13,101,15],[98,13,98,15],[100,13,100,15],[93,13,93,15],[91,13,91,15],[96,13,96,15],[92,13,92,15],[80,13,80,15],[81,13,81,15],[89,13,89,15],[56,13,56,15],[65,13,65,15],[62,13,62,15],[63,13,63,15],[84,13,84,15],[78,13,78,15],[79,13,79,15],[70,13,70,15],[61,13,61,15],[75,13,75,15],[71,13,71,15],[69,13,69,15],[64,13,64,15],[7,1,7,3],[18,13,18,15],[22,13,22,15],[7,4,7,22],[13,13,13,15],[16,13,16,15],[14,13,14,15],[17,13,17,15],[19,13,19,15],[20,13,20,15],[3,5,3,22],[11,13,11,15],[12,13,12,15],[22,18,22,19],[25,13,25,15],[23,13,23,15],[22,8,22,12],[27,13,27,15],[28,13,28,15],[30,13,30,15],[50,13,50,15],[49,13,49,15],[41,13,41,15],[38,13,38,15],[34,13,34,15],[35,13,35,15],[36,13,36,15],[53,13,53,15],[40,13,40,15],[37,13,37,15],[42,13,42,15],[60,13,60,15],[52,13,52,15],[55,13,55,15],[45,13,45,15],[47,13,47,15],[46,13,46,15],[48,13,48,15]]}
[null,"Economic Profitability Calculation - Input data"]
[]
[]
[null,"Project title:",null,null,null,"Example project"]
[]
[100,"(excl. VAT)",null,null,null,"Input cell"]
[]
[101,"Warnings:",null,null,{"$f":"IF(AD8>10,\"Mehr als 10 Warnungen oder Fehler!\",IF(AD8>0,AE8,\"\"))","v":""},null,null,null,null,null,null,null,null,null,null,null,null,null,null,null,null,null,null,null,null,null,null,null,null,{"$f":"SUM(AB11:AD131)","v":0},{"$f":"AE11&AE27&AE34&AE45&AE60&AE69&AE74","v":""}]
[]
[102,"Quantity of heat, heat price and connection fees",null,null,null,null,null,null,null,null,null,null,null,null,null,null,null,null,null,null,null,null,null,null,null,"Min","Max","Undercut","Surpass","S. Error","Warning","SumSp","MinText","MaxText","OtherText"]
[null,null,null,null,null,null,null,null,null,null,null,null,null,null,null,null,null,null,null,null,null,null,null,null,null,null,null,null,null,null,{"$f":"AE12&AE13&AE14&AE17&AE18&AE19&AE23&AE26&AE15&AE20&AE24&AE21","v":""},"x"]
[103,null,null,null,null,null,null,null,null,null,null,null,"Annual heat sale",7750,null,null,"MWh/a",null,null,null,null,null,null,null,null,10,9999999999,{"$f":"IF($N12<Z12,1,0)","v":0},{"$f":"IF($N12>AA12,1,0)","v":0},0,{"$f":"IF(AB12=1,AG12,IF(AC12=1,AH12,IF(AD12=1,AI12,\"\")))","v":""},null,"The amont of heat sold is too small! ","The amont of heat sold is too large!"]
[104,null,null,null,null,null,null,null,null,null,null,null,"Internal heat consumption",0,null,null,"MWh/a",null,null,null,null,null,null,null,null,0,9999999999,{"$f":"IF($N13<Z13,1,0)","v":0},{"$f":"IF($N13>AA13,1,0)","v":0},{"$f":"IF(InternalHeatCons>HeatQuantitySold,1,0)","v":0},{"$f":"IF(AB13=1,AG13,IF(AC13=1,AH13,IF(AD13=1,AI13,\"\")))","v":""},null,"The internal heat consumption is negativ!","The internal heat consumption is too large!","The internal heat consumption is greater than the amount of heat sold!"]
[105,null,null,null,null,null,null,null,null,null,null,null,"Annual efficiency of the biomass boiler(s)",85,null,null,"%",null,null,null,null," ",null,null,null,40,98,{"$f":"IF($N14<Z14,1,0)","v":0},{"$f":"IF($N14>AA14,1,0)","v":0},{"$f":"IF(InternalHeatCons>HeatQuantitySold,1,0)","v":0},{"$f":"IF(AB14>0,AG14,\"\")&IF(AC14>0,AH14,\"\")&IF(AD14>0,AI14,\"\")","v":""},null,"The annual utilisation rate of the biomass boiler(s) is below 40 %.","The annual utilisation rate of the biomass boiler(s) is over 98 %."]
[106,null,null,null,null,null,null,null,null,null,null,null,"Annual efficiency of the District Heating Network (DHN)",70,null,null,"%",null,null,null,null,null,null,null,null,40,99,{"$f":"IF($N15<Z15,1,0)","v":0},{"$f":"IF($N15>AA15,1,0)","v":0},{"$f":"IF(N15=\"\",1,0)","v":0},{"$f":"IF(AB15>0,AG15,\"\")&IF(AC15>0,AH15,\"\")&IF(AD15>0,AI15,\"\")","v":""},null,"The annual utilisation rate of the district heating network is too low!","The annual utilisation rate of the district heating network is too large!","Kein Jahresnutzungsgrad Netz angegeben! "]
[]
[107,null,null,null,null,null,null,null,null,null,null,null,"Development of heat sale - year 1",60,null,null,"% of total annual heat sale",null,null,null,null,null,null,null,null,0,100,{"$f":"IF($N17<Z17,1,0)","v":0},{"$f":"IF($N17>AA17,1,0)","v":0},{"$f":"IF(N17=\"\",1,0)","v":0},{"$f":"IF(AB17>0,AG17,\"\")&IF(AC17>0,AH17,\"\")&IF(AD17>0,AI17,\"\")","v":""},null,"The heat sale of the first year is too low"]
[null,null,null,null,null,null,null,null,null,null,null,null,"Development of heat sale - year 2",80,null,null,"% of total annual heat sale",null,null,null,null,null,null,null,null,1,100,{"$f":"IF($N18<Z18,1,0)","v":0},{"$f":"IF($N18>AA18,1,0)","v":0},{"$f":"IF(ConsFactor_y2<ConsFactor_y1,1,0)","v":0},{"$f":"IF(AB18>0,AG18,\"\")&IF(AC18>0,AH18,\"\")&IF(AD18>0,AI18,\"\")","v":""},null,"The heat sale of the second year is too low","The heat consumption factor of the second year is too large","The heat consumption factor of the second year is smaller than in the first year."]
[null,null,null,null,null,null,null,null,null,null,null,null,"Development of heat sale - year 3",100,null,null,"% of total annual heat sale",null,null,null,null,null,null,null,null,2,100,{"$f":"IF($N19<Z19,1,0)","v":0},{"$f":"IF($N19>AA19,1,0)","v":0},{"$f":"IF(ConsFactor_y3<ConsFactor_y2,1,0)","v":0},{"$f":"IF(AB19>0,AG19,\"\")&IF(AC19>0,AH19,\"\")&IF(AD19>0,AI19,\"\")","v":""},null,"The heat sale development of the third year is too low","The heat sale development of  year 3 is too high","The heat consumption factor of the third year is smaller than in the second year."]
[108,null,null,null,null,null,null,null,null,null,null,null,"Annual increase of the heat sale from year 4 onwards",0,null,null,"%",null,null,null,null,null,null,null,null,0,5,{"$f":"IF($N20<Z20,1,0)","v":0},{"$f":"IF($N20>AA20,1,0)","v":0},{"$f":"IF(ConsFactor_y4onwards=\"\",1,0)","v":0},{"$f":"IF(AB20>0,AG20,\"\")&IF(AC20>0,AH20,\"\")&IF(AD20>0,AI20,\"\")","v":""},null,"The increase of the heat sale of  year 4 and onwards is negativ!","The annual increase of the heat sale from year 4 onwards is too high!","The increase of the heat consumption factor of the 4 year onwards is not defined."]
{"$rows_left_out":86}
{"sheet":"Heat price","index":3,"n_rows":60,"n_cols":12,"rows_kept":60,"cut":false,"hidden":false,"merged":[[11,2,11,8],[2,3,2,8],[62,8,62,13],[15,3,15,4],[25,3,25,4],[35,3,35,4]]}
[null,"Economic Profitability Calculation - Heat price"]
[]
[null,"Project title:",null,{"$f":"IF('Input data'!F4<>\"\",'Input data'!F4,\"\")","v":"Example project"}]
[null,null,null,null,null,null,null,null,null,true]
[100,"(excl. VAT)",null,"Input cell",null,null,null,null,null,true]
[]
[401,"Option",null,"Calculation from basic, meter and energy charge",null,null,null,null,null,{"$f":"IF(J4,(G23*G16+G26*G33+G36*G43)/100*1000,G48)","v":61.863636363636367}]
[402,null,null,"Heat price graduation according to heat sale",null,null,null,null,null,{"$f":"IF(J5,(J60+K60+L60)/100*1000,0)","v":57.210454545454553}]
[]
[403,"Determined heat price:",null,null,{"$f":"IF(AND(J4,J5),J8,J7)","v":57.210454545454553},"€/MWh",null,{"$f":"E10/1000","v":5.721045454545455E-2},"€/kWh","Error","Warning"]
[]
[null,"Warnings:",{"$f":"IF(J12>0,K12,\"\")","v":""},null,null,null,null,null,null,{"$f":"SUM(J14:J43)","v":0},{"$f":"K14&K16&K17&K18&K19&K20&K21&K23&K26&K27&K28&K29&K30&K31&K33&K36&K37&K38&K39&K40&K41&K43&K7","v":""}]
[]
[404,"Calculation from basic, meter and energy charge",null,null,null,null,null,null,null,{"$f":"IF(G16+G26+G36>100,1,0)","v":0},{"$f":"IF(J14>0,L14,\"\")","v":""},"Sum of heat consumption of all consumers types is higher than 100%. Correct it! Check position 405, 412 & 413."]
[]
[405,"Customer type 1",null,"Private customer",null,null,15,"% of the heat sale",null,{"$f":"IF(G16+G26+G36<100,1,0)","v":0},{"$f":"IF(J16>0,L16,\"\")","v":""},"Sum of heat consumption of all consumers type is lower than 100%. Correct it! Check position 405, 412 & 413."]
[406,null,null,null,null,"Basic charge",60,"€/kW",null,null,{"$f":"IF(J17>0,L17,\"\")","v":""}]
[407,null,null,null,null,"Meter charge",60,"€/a",null,null,""]
[408,null,null,null,null,"Energy charge",4.4999999999999998E-2,"€/kWh",null,null,""]
[409,null,null,null,null,"Average installed capacity",14,"kW",null,{"$f":"IF(G20>G30,1,0)","v":0},"","Installed capacity (i.e. expected connected load) for private consumers is higher than for commercial consumers! "]
{"$rows_left_out":41}
{"sheet":"Results","index":4,"n_rows":89,"n_cols":23,"rows_kept":89,"cut":false,"hidden":false,"merged":[[19,3,19,11],[19,12,19,16],[2,3,2,8],[3,7,3,8],[4,7,4,8]]}
[900,"Economic Profitability Calculation - Results"]
[]
[null,"Project title:",null,{"$f":"IF('Input data'!F4<>\"\",'Input data'!F4,\"\")","v":"Example project"},null,null,null,null,null,null,null,{"$f":"IF('Input data'!E8&'Heat price'!C12<>\"\",\"Es existieren Warnungen\",\"\")","v":""}]
[156,"Investment:",null,{"$f":"TotalInvestment","v":2355000},"€",null,"Subsidies:",{"$f":"IF('Input data'!AG75,SubsidyAmount,0)","v":687000},null,"€"]
[161,"Equity",null,{"$f":"Equity","v":300000},"€",null,"Project start",{"$f":"ProjectStart","v":2009}]
[]
[901,"Operating costs (100% heat sale in year 1)",null,null,null,null,"Amount [€]","Index [%]","Basis [a]",null,905,"Revenues (100% heat sale in year 1)",null,null,null,"Amount [€]","Index [%]","Basis [a]"]
[null,null,null,null,null,null,{"$f":"SUM(G10:G17)","v":397268.27731092426},{"$f":"(G10*H10+G11*H11+G12*H12+G13*H13+G14*H14+G15*H15+G16*H16+G17*H17)/(SUM(G10:G17))","v":2.3596732305762518E-2},{"$f":"ProjectStart","v":2009},null,null,null,null,null,null,{"$f":"SUM(P10:P12)","v":507250},{"$f":"(P10*Q10+P11*Q11+P12*Q12)/(SUM(P10:P12))","v":2.5034499753573188E-2},{"$f":"ProjectStart","v":2009}]
[]
[null,"Biomass fuel",null,null,null,null,{"$f":"BiomassFuelPrice*BiomassFuelUsed","v":321722.68907563016},{"$f":"BiomassFuelPriceTrend/100","v":0.02},2009,null,null,"Heat sale",null,null,null,{"$f":"HeatQuantitySold*HeatSalesPrice","v":503750},{"$f":"HeatSalesPriceTrend/100","v":2.5000000000000001E-2},{"$f":"ProjectStart","v":2009}]
[null,"Fossil fuel",null,null,null,null,{"$f":"FossilFuelUsed*FossilFuelPrice","v":36470.588235294119},{"$f":"FossilFuelPriceTrend/100","v":0.05},2009,null,null,"Ongoing subsidy",null,null,null,{"$f":"IF('Input data'!$AG$79,OngoingSubsidyYear1,0)","v":3500},{"$f":"IF(P11=0,0,OngoingSubsidyTrend/100)","v":0.03},{"$f":"IF(P11=0,\"\",ProjectStart)","v":2009}]
[null,"Personnel costs",null,null,null,null,{"$f":"PersonnelExpenses","v":15000},{"$f":"PersonnelExpensesTrend/100","v":0.02},2009,null,null,"Additional revenues",null,null,null,{"$f":"OtherRevenues","v":0},{"$f":"IF(P12=0,0,OtherRevenuesTrend/100)","v":0},{"$f":"IF(P12=0,\"\",ProjectStart)","v":""}]
[null,"Electricity",null,null,null,null,{"$f":"'Input data'!N95","v":10075},{"$f":"ElectricityPriceTrend/100","v":0.05},2009,null,910,"Results:",null,null,null,"Amount [€]"]
[null,"Bookkeeping and consulting",null,null,null,null,{"$f":"AccountingConsultingExp","v":0},{"$f":"IF(G14=0,0,AccountingConsultingExpTrend/100)","v":0},{"$f":"IF(G14=0,\"\",ProjectStart)","v":""},null,null,"NPV (Period 1-10)",null,null,null,{"$f":"NPV(InterestRate/100,R25:R$34)","v":-69025.991397296588}]
[null,"Maintenance",null,null,null,null,{"$f":"MaintenanceCosts","v":9000},{"$f":"MaintenanceCostsTrend/100","v":0.02},2009,null,null,"NPV (Period 1-15)",null,null,null,{"$f":"NPV(InterestRate/100,R25:R$39)","v":55082.915814229418}]
[null,"Rent / leasehold / land",null,null,null,null,{"$f":"LandCosts","v":3500},{"$f":"IF(G16=0,0,LandCostsTrend/100)","v":2.5000000000000001E-2},{"$f":"IF(G16=0,\"\",ProjectStart)","v":2009},null,null,"NPV (Period 1-20)",null,null,null,{"$f":"NPV(InterestRate/100,R25:R$44)","v":196416.82715755884}]
[null,"Others (insurance etc.)",null,null,null,null,{"$f":"OtherCosts","v":1500},{"$f":"IF(G17=0,0,OtherCostsTrend/100)","v":0.03},{"$f":"IF(G17=0,\"\",ProjectStart)","v":2009},null,null,"NPV (Period 1-25)",null,null,null,{"$f":"NPV(InterestRate/100,R25:R$49)","v":491013.60457796452}]
[]
[]
[920,null,null,"Disbursements",null,null,null,null,null,null,null,null,"Inpayments"]
{"$rows_left_out":70}
{"sheet":"Interpretation","index":5,"n_rows":8,"n_cols":6,"rows_kept":8,"cut":false,"hidden":false,"merged":[[7,1,7,22],[3,5,3,22]]}
[null,"Economic Profitability Calculation - Interpretation"]
[]
[]
[null,"Project title:",null,null,null,"Musterprojekt Mustermann"]
[]
[null,"Comments on the profitability assessment results (Interpretation)"]
[]
[500]